Reaction Details
TargetAdenosine receptor A1
LigandBDBM50368546
Substrate/Competitorn/a
Meas. Tech.ChEBML_29144
Ki 13±n/a nM
Citation Bridges, AJMoos, WHSzotek, DLTrivedi, BKBristol, JAHeffner, TGBruns, RFDowns, DA N6-(2,2-diphenylethyl)adenosine, a novel adenosine receptor agonist with antipsychotic-like activity. J Med Chem30:1709-11 (1987) Adenosine receptor A1
Name:Adenosine receptor A1
Type:Protein
Mol. Mass.:36704.13
Organism:Rattus norvegicus (rat)
Description:n/a
Residue:326
BDBM50368546
NameBDBM50368546
Synonyms:CHEMBL1257013 | N6-2-Phenylethyladenosine
TypeSmall organic molecule
Emp. Form.C18H21N5O4
Mol. Mass.371.3904
SMILESOC[C@H]1O[C@H]([C@H](O)[C@@H]1O)n1cnc2c(NCCc3ccccc3)ncnc12