Reaction Details
TargetcGMP-inhibited 3',5'-cyclic phosphodiesterase 3A/3B
LigandBDBM15296
Substrate/Competitorn/a
Meas. Tech.ChEMBL_154398 (CHEMBL759160)
IC50 2500±n/a nM
Citation Moos, WHHumblet, CCSircar, IRithner, CWeishaar, REBristol, JAMcPhail, AT Cardiotonic agents. 8. Selective inhibitors of adenosine 3',5'-cyclic phosphate phosphodiesterase III. Elaboration of a five-point model for positive inotropic activity. J Med Chem30:1963-72 (1987) cGMP-inhibited 3',5'-cyclic phosphodiesterase 3A/3B
Name:cGMP-inhibited 3',5'-cyclic phosphodiesterase 3A/3B
Type:n/a
Mol. Mass.:n/a
Description:ASSAY_ID of ChEMBL is 156458
Components:This complex has 2 components.
Component 1
Name:cGMP-inhibited 3',5'-cyclic phosphodiesterase 3B
Synonyms:CGI-PDE B CGIPDE1 PDE3B Phosphodiesterase 3B Phosphodiesterase Type 3 (PDE3B) cGMP-inhibited 3,5-cyclic phosphodiesterase B
Type:Enzyme
Mol. Mass.:124318.95
Organism:Homo sapiens (Human)
Description:PDE3B was generated from the full-length recombinant human clone transfected into Sf9 cells.
Residue:1112
Component 2
Name:cGMP-inhibited 3',5'-cyclic phosphodiesterase 3A
Synonyms:3',5'-cyclic phosphodiesterase Cyclic GMP-inhibited phosphodiesterase A PDE3A_HUMAN Phosphodiesterase 3 (PDE3) Phosphodiesterase 3A Phosphodiesterase 3A (PDE3A1) cGMP-inhibited 3',5'-cyclic phosphodiesterase A | cGMP-inhibited 3,5-cyclic phosphodiesterase A
Type:Enzyme
Mol. Mass.:124966.46
Organism:Homo sapiens (Human)
Description:Q14432
Residue:1141
BDBM15296
NameBDBM15296
Synonyms:6-methyl-2-oxo-5-(pyridin-4-yl)-1,2-dihydropyridine-3-carbonitrile CHEMBL189 Primacor US9249139, Milrinone
TypeSmall organic molecule
Emp. Form.C12H9N3O
Mol. Mass.211.2194
SMILESCc1[nH]c(=O)c(cc1-c1ccncc1)C#N