Reaction Details
TargetcGMP-dependent 3',5'-cyclic phosphodiesterase
LigandBDBM34651
Substrate/Competitorn/a
Meas. Tech.ChEMBL_154259 (CHEMBL765557)
IC50 580000±n/a nM
Citation Moos, WHHumblet, CCSircar, IRithner, CWeishaar, REBristol, JAMcPhail, AT Cardiotonic agents. 8. Selective inhibitors of adenosine 3',5'-cyclic phosphate phosphodiesterase III. Elaboration of a five-point model for positive inotropic activity. J Med Chem30:1963-72 (1987) cGMP-dependent 3',5'-cyclic phosphodiesterase
Name:cGMP-dependent 3',5'-cyclic phosphodiesterase
Type:Enzyme Catalytic Domain
Mol. Mass.:105691.58
Organism:Homo sapiens (Human)
Description:O00408
Residue:941
BDBM34651
NameBDBM34651
Synonyms:Amrinon CHEMBL12856 INAMRINONE MLS000069829 Win40680 cid_3698
TypeSmall organic molecule
Emp. Form.C10H9N3O
Mol. Mass.187.198
SMILESNc1cc(c[nH]c1=O)-c1ccncc1