Reaction Details
TargetThymidylate synthase
LigandBDBM50023908
Substrate/Competitorn/a
Meas. Tech.ChEBML_209614
IC50 20000±n/a nM
Citation Brixner, DIUeda, TCheng, YCHynes, JBBroom, AD Folate analogues as inhibitors of thymidylate synthase. J Med Chem30:675-8 (1987) Thymidylate synthase
Name:Thymidylate synthase
Type:Enzyme
Mol. Mass.:35718.07
Organism:Homo sapiens (Human)
Description:n/a
Residue:313
BDBM50023908
NameBDBM50023908
Synonyms:2-{4-[(2,4-Diamino-pteridin-6-ylmethyl)-ethynyl-amino]-benzoylamino}-pentanedioic acid | CHEMBL161567
TypeSmall organic molecule
Emp. Form.C21H20N8O5
Mol. Mass.464.4341
SMILESNc1nc(N)c2nc(CN(C#C)c3ccc(cc3)C(=O)NC(CCC(O)=O)C(O)=O)cnc2n1