Reaction Details
TargetRyanodine receptor 1
LigandBDBM50044994
Substrate/Competitorn/a
Meas. Tech.ChEMBL_921272 (CHEMBL3054398)
IC50 10±n/a nM
Citation Waterhouse, ALPessah, INFrancini, AOCasida, JE Structural aspects of ryanodine action and selectivity. J Med Chem30:710-6 (1987) Ryanodine receptor 1
Name:Ryanodine receptor 1
Type:PROTEIN
Mol. Mass.:565099.26
Organism:Oryctolagus cuniculus
Description:ChEMBL_19634
Residue:5037
BDBM50044994
NameBDBM50044994
Synonyms:2,6,9,11,13,14-hexahydroxy-11-isopropyl-3,7,10-trimethyl-(2R,3S,7S,12R)-15-oxapentacyclo[7.5.1.01,6.07,13.010,14]pentadec-12-yl 1H-2-pyrrolecarboxylate(Ryanodine) | Ryanodine
TypeSmall organic molecule
Emp. Form.C25H35NO9
Mol. Mass.493.5467
SMILESCC(C)[C@@]1(O)[C@@H](OC(=O)c2cc[nH]c2)[C@@]2(O)[C@]3(C)C[C@@]4(O)O[C@@]5([C@H](O)[C@@H](C)CC[C@]35O)[C@@]2(O)[C@]14C