Reaction Details
TargetRyanodine receptor 1
LigandBDBM50016406
Substrate/Competitorn/a
Meas. Tech.ChEMBL_921272 (CHEMBL3054398)
IC50 280±n/a nM
Citation Waterhouse, ALPessah, INFrancini, AOCasida, JE Structural aspects of ryanodine action and selectivity. J Med Chem30:710-6 (1987) Ryanodine receptor 1
Name:Ryanodine receptor 1
Type:PROTEIN
Mol. Mass.:565099.26
Organism:Oryctolagus cuniculus
Description:ChEMBL_19634
Residue:5037
BDBM50016406
NameBDBM50016406
Synonyms:2,6,11,13,14-pentahydroxy-11-isopropyl-9-methoxy-3,7,10-trimethyl-(1R,2R,3S,6S,7S,9S,10R,11S,12R,13S,14R)-15-oxapentacyclo[7.5.1.01,6.07,13.010,14]pentadec-12-yl 1-methyl-1H-2-pyrrolecarboxylate | CHEMBL2273042
TypeSmall organic molecule
Emp. Form.C27H39NO9
Mol. Mass.521.5999
SMILESCO[C@@]12C[C@@]3(C)[C@@]4(O)CC[C@H](C)[C@@H](O)[C@]4(O1)[C@]1(O)[C@@]3(O)[C@H](OC(=O)c3cccn3C)[C@](O)(C(C)C)[C@]21C