Reaction Details
TargetRyanodine receptor 1
LigandBDBM50016404
Substrate/Competitorn/a
Meas. Tech.ChEMBL_921272 (CHEMBL3054398)
IC50 4900±n/a nM
Citation Waterhouse, ALPessah, INFrancini, AOCasida, JE Structural aspects of ryanodine action and selectivity. J Med Chem30:710-6 (1987) Ryanodine receptor 1
Name:Ryanodine receptor 1
Type:PROTEIN
Mol. Mass.:565099.26
Organism:Oryctolagus cuniculus
Description:ChEMBL_19634
Residue:5037
BDBM50016404
NameBDBM50016404
Synonyms:2,3,6,9,11,13,14-heptahydroxy-3-hydroxymethyl-11-isopropyl-7,10-dimethyl-(1R,2R,3S,6S,7S,9S,10R,11S,12R,13S,14R)-15-oxapentacyclo[7.5.1.01,6.07,13.010,14]pentadec-12-yl 1H-2-pyrrolecarboxylate CHEMBL354013
TypeSmall organic molecule
Emp. Form.C25H35NO11
Mol. Mass.525.5455
SMILESCC(C)[C@@]1(O)[C@@H](OC(=O)c2ccc[nH]2)[C@@]2(O)[C@@]3(C)C[C@]4(O)O[C@@]5([C@H](O)[C@](O)(CO)CC[C@]35O)[C@@]2(O)[C@]14C