Reaction Details
TargetRyanodine receptor 1
LigandBDBM50016415
Substrate/Competitorn/a
Meas. Tech.ChEMBL_921272 (CHEMBL3054398)
IC50 35000±n/a nM
Citation Waterhouse, ALPessah, INFrancini, AOCasida, JE Structural aspects of ryanodine action and selectivity. J Med Chem30:710-6 (1987) Ryanodine receptor 1
Name:Ryanodine receptor 1
Type:PROTEIN
Mol. Mass.:565099.26
Organism:Oryctolagus cuniculus
Description:ChEMBL_19634
Residue:5037
BDBM50016415
NameBDBM50016415
Synonyms:11-isopropyl-3,7,10-trimethyl-(1R,2R,3S,6S,7S,9S,10R,11S,12R,13S,14R)-15-oxapentacyclo[7.5.1.01,6.07,13.010,14]pentadecane-2,6,9,11,12,13,14-heptaol(ryanodol) Ryanodol
TypeSmall organic molecule
Emp. Form.C20H32O8
Mol. Mass.400.4633
SMILESCC(C)[C@@]1(O)[C@@H](O)[C@@]2(O)[C@@]3(C)C[C@]4(O)O[C@@]5([C@H](O)[C@@H](C)CC[C@]35O)[C@@]2(O)[C@]14C