Reaction Details
TargetAdenosine receptor A1
LigandBDBM50009552
Substrate/Competitorn/a
Meas. Tech.ChEBML_28964
IC50 2.5±n/a nM
Citation Kwatra, MMLeung, EHosey, MMGreen, RD N6-phenyladenosines: pronounced effect of phenyl substituents on affinity for A2 adenosine receptors. J Med Chem30:954-6 (1987) Adenosine receptor A1
Name:Adenosine receptor A1
Type:Enzyme Catalytic Domain
Mol. Mass.:36337.19
Organism:Chick
Description:ADENOSINE A1 ADORA1 Chick::P49892
Residue:324
BDBM50009552
NameBDBM50009552
Synonyms:2-[6-Amino-2-(2-morpholin-4-yl-ethylamino)-purin-9-yl]-5-hydroxymethyl-tetrahydro-furan-3,4-diol CHEMBL45891 | N6-Cyclohexylado (CHA)
TypeSmall organic molecule
Emp. Form.C16H23N5O4
Mol. Mass.349.3849
SMILESOC[C@H]1O[C@H]([C@H](O)[C@@H]1O)n1cnc2c(NC3CCCCC3)ncnc12