Reaction Details
TargetDipeptidase 1
LigandBDBM50024059
Substrate/Competitorn/a
Meas. Tech.ChEBML_216035
Ki 150±n/a nM
Citation Graham, DWAshton, WTBarash, LBrown, JEBrown, RDCanning, LFChen, ASpringer, JPRogers, EF Inhibition of the mammalian beta-lactamase renal dipeptidase (dehydropeptidase-I) by (Z)-2-(acylamino)-3-substituted-propenoic acids. J Med Chem30:1074-90 (1987) Dipeptidase 1
Name:Dipeptidase 1
Type:Enzyme Catalytic Domain
Mol. Mass.:44697.32
Organism:GUINEA PIG
Description:Leukotriene D4 Alpha 0 GUINEA PIG::P22412
Residue:409
BDBM50024059
NameBDBM50024059
Synonyms:7-Bromo-2-[(2,2-dimethyl-cyclopropanecarbonyl)-amino]-hept-2-enoic acid | CHEMBL273926
TypeSmall organic molecule
Emp. Form.C13H20BrNO3
Mol. Mass.318.207
SMILESCC1(C)CC1C(=O)N\C(=C/CCCCBr)C(O)=O