Reaction Details
TargetBifunctional dihydrofolate reductase-thymidylate synthase
LigandBDBM50291765
Substrate/Competitorn/a
Meas. Tech.ChEMBL_55096 (CHEMBL875027)
Ki 6.607E2±n/a nM
Citation Booth, RGSelassie, CDHansch, CSanti, DV Quantitative structure-activity relationship of triazine-antifolate inhibition of Leishmania dihydrofolate reductase and cell growth. J Med Chem30:1218-24 (1987) Bifunctional dihydrofolate reductase-thymidylate synthase
Name:Bifunctional dihydrofolate reductase-thymidylate synthase
Type:Protein
Mol. Mass.:58691.04
Organism:Leishmania major
Description:P07382
Residue:520
BDBM50291765
NameBDBM50291765
Synonyms:1-{3-[(4-Chloro-phenylamino)-methyl]-phenyl}-6,6-dimethyl-1,6-dihydro-[1,3,5]triazine-2,4-diamine | CHEMBL20393
TypeSmall organic molecule
Emp. Form.C18H21ClN6
Mol. Mass.356.853
SMILESCC1(C)N=C(N)N=C(N)N1c1cccc(CNc2ccc(Cl)cc2)c1