Reaction Details
TargetAromatase
LigandBDBM9460
Substrate/Competitorn/a
Meas. Tech.ChEBML_51214
EC50 260±n/a nM
Citation Taylor, HMJones, CDDavenport, JDHirsch, KSKress, TJWeaver, D Aromatase inhibition by 5-substituted pyrimidines and dihydropyrimidines. J Med Chem30:1359-65 (1987) Aromatase
Name:Aromatase
Type:PROTEIN
Mol. Mass.:58418.09
Organism:Rattus norvegicus
Description:ChEMBL_51211
Residue:508
BDBM9460
NameBDBM9460
Synonyms:3-(4-aminophenyl)-3-ethyl-piperidine-2,6-dione Aminoglutethimide AG, 4 Cytadren Elipten | aminoglutethimide (AG)
TypeSmall organic molecule
Emp. Form.C13H16N2O2
Mol. Mass.232.2783
SMILESCCC1(CCC(=O)NC1=O)c1ccc(N)cc1