Reaction Details
TargetN-acetyllactosaminide alpha-1,3-galactosyltransferase
LigandBDBM50367549
Substrate/Competitorn/a
Meas. Tech.ChEBML_219109
Ki 165000±n/a nM
Citation Vaghefi, MMBernacki, RJDalley, NKWilson, BERobins, RK Synthesis of glycopyranosylphosphonate analogues of certain natural nucleoside diphosphate sugars as potential inhibitors of glycosyltransferases. J Med Chem30:1383-91 (1987) N-acetyllactosaminide alpha-1,3-galactosyltransferase
Name:N-acetyllactosaminide alpha-1,3-galactosyltransferase
Type:PROTEIN
Mol. Mass.:46474.57
Organism:Mus musculus
Description:ChEMBL_219109
Residue:394
BDBM50367549
NameBDBM50367549
Synonyms:CHEMBL604428
TypeSmall organic molecule
Emp. Form.C15H24N2O16P2
Mol. Mass.550.3024
SMILESOC[C@H]1OC([C@H](O)[C@@H](O)[C@@H]1O)P(O)(=O)OP(O)(=O)OC[C@H]1OC([C@H](O)[C@@H]1O)n1ccc(=O)[nH]c1=O