Reaction Details
TargetSodium-dependent serotonin transporter
LigandBDBM50367558
Substrate/Competitorn/a
Meas. Tech.ChEBML_193337
Ki 1.7±n/a nM
Citation Maryanoff, BEMcComsey, DFGardocki, JFShank, RPCostanzo, MJNortey, SOSchneider, CRSetler, PE Pyrroloisoquinoline antidepressants. 2. In-depth exploration of structure-activity relationships. J Med Chem30:1433-54 (1987) Sodium-dependent serotonin transporter
Name:Sodium-dependent serotonin transporter
Type:Multi-pass membrane protein
Mol. Mass.:70168.43
Organism:Rattus norvegicus (rat)
Description:P31652
Residue:630
BDBM50367558
NameBDBM50367558
Synonyms:CHEMBL1743794
TypeSmall organic molecule
Emp. Form.C19H21NO
Mol. Mass.279.3761
SMILESCOc1ccc(cc1)[C@@H]1CN2CCC[C@@H]2c2ccccc12