Reaction Details
TargetTransporter
LigandBDBM50367561
Substrate/Competitorn/a
Meas. Tech.ChEBML_193336
Ki 1.5±n/a nM
Citation Maryanoff, BEMcComsey, DFGardocki, JFShank, RPCostanzo, MJNortey, SOSchneider, CRSetler, PE Pyrroloisoquinoline antidepressants. 2. In-depth exploration of structure-activity relationships. J Med Chem30:1433-54 (1987) Transporter
Name:Transporter
Type:PROTEIN
Mol. Mass.:66787.87
Organism:Rattus norvegicus
Description:ChEMBL_1463061
Residue:597
BDBM50367561
NameBDBM50367561
Synonyms:CHEMBL1743791
TypeSmall organic molecule
Emp. Form.C18H18BrN
Mol. Mass.328.246
SMILESBrc1ccccc1[C@@H]1CN2CCC[C@@H]2c2ccccc12