Reaction Details
TargetSodium-dependent serotonin transporter
LigandBDBM50028094
Substrate/Competitorn/a
Meas. Tech.ChEBML_193337
Ki 0.850000±n/a nM
Citation Maryanoff, BEMcComsey, DFGardocki, JFShank, RPCostanzo, MJNortey, SOSchneider, CRSetler, PE Pyrroloisoquinoline antidepressants. 2. In-depth exploration of structure-activity relationships. J Med Chem30:1433-54 (1987) Sodium-dependent serotonin transporter
Name:Sodium-dependent serotonin transporter
Type:Multi-pass membrane protein
Mol. Mass.:70168.43
Organism:Rattus norvegicus (rat)
Description:P31652
Residue:630
BDBM50028094
NameBDBM50028094
Synonyms:(1S,4S)-4-(3,4-dichlorophenyl)-N-methyl-1,2,3,4-tetrahydronaphthalen-1-amine CHEMBL809 | SERTRALINE
TypeSmall organic molecule
Emp. Form.C17H17Cl2N
Mol. Mass.306.23
SMILESCN[C@H]1CC[C@@H](c2ccc(Cl)c(Cl)c2)c2ccccc12