Reaction Details
TargetSodium-dependent serotonin transporter
LigandBDBM50367559
Substrate/Competitorn/a
Meas. Tech.ChEBML_193337
Ki 4.4±n/a nM
Citation Maryanoff, BEMcComsey, DFGardocki, JFShank, RPCostanzo, MJNortey, SOSchneider, CRSetler, PE Pyrroloisoquinoline antidepressants. 2. In-depth exploration of structure-activity relationships. J Med Chem30:1433-54 (1987) Sodium-dependent serotonin transporter
Name:Sodium-dependent serotonin transporter
Type:Multi-pass membrane protein
Mol. Mass.:70168.43
Organism:Rattus norvegicus (rat)
Description:P31652
Residue:630
BDBM50367559
NameBDBM50367559
Synonyms:CHEMBL1743798
TypeSmall organic molecule
Emp. Form.C18H17F2N
Mol. Mass.285.3311
SMILESFc1ccc(cc1)[C@@H]1CN2CCC[C@@H]2c2cc(F)ccc12