Reaction Details
TargetD(1A) dopamine receptor
LigandBDBM50367559
Substrate/Competitorn/a
Meas. Tech.ChEBML_58645
Ki 183±n/a nM
Citation Maryanoff, BEMcComsey, DFGardocki, JFShank, RPCostanzo, MJNortey, SOSchneider, CRSetler, PE Pyrroloisoquinoline antidepressants. 2. In-depth exploration of structure-activity relationships. J Med Chem30:1433-54 (1987) D(1A) dopamine receptor
Name:D(1A) dopamine receptor
Type:Enzyme Catalytic Domain
Mol. Mass.:49429.75
Organism:RAT
Description:P18901
Residue:446
BDBM50367559
NameBDBM50367559
Synonyms:CHEMBL1743798
TypeSmall organic molecule
Emp. Form.C18H17F2N
Mol. Mass.285.3311
SMILESFc1ccc(cc1)[C@@H]1CN2CCC[C@@H]2c2cc(F)ccc12