Reaction Details
TargetD(2) dopamine receptor
LigandBDBM50367559
Substrate/Competitorn/a
Meas. Tech.ChEMBL_62386 (CHEMBL672339)
Ki 241±n/a nM
Citation Maryanoff, BEMcComsey, DFGardocki, JFShank, RPCostanzo, MJNortey, SOSchneider, CRSetler, PE Pyrroloisoquinoline antidepressants. 2. In-depth exploration of structure-activity relationships. J Med Chem30:1433-54 (1987) D(2) dopamine receptor
Name:D(2) dopamine receptor
Type:G Protein-Coupled Receptor (GPCR)
Mol. Mass.:50931.60
Organism:Rattus norvegicus (rat)
Description:P61169
Residue:444
BDBM50367559
NameBDBM50367559
Synonyms:CHEMBL1743798
TypeSmall organic molecule
Emp. Form.C18H17F2N
Mol. Mass.285.3311
SMILESFc1ccc(cc1)[C@@H]1CN2CCC[C@@H]2c2cc(F)ccc12