Reaction Details
TargetSodium-dependent serotonin transporter
LigandBDBM50367554
Substrate/Competitorn/a
Meas. Tech.ChEBML_193337
Ki 1.5±n/a nM
Citation Maryanoff, BEMcComsey, DFGardocki, JFShank, RPCostanzo, MJNortey, SOSchneider, CRSetler, PE Pyrroloisoquinoline antidepressants. 2. In-depth exploration of structure-activity relationships. J Med Chem30:1433-54 (1987) Sodium-dependent serotonin transporter
Name:Sodium-dependent serotonin transporter
Type:Multi-pass membrane protein
Mol. Mass.:70168.43
Organism:Rattus norvegicus (rat)
Description:P31652
Residue:630
BDBM50367554
NameBDBM50367554
Synonyms:CHEMBL1743782
TypeSmall organic molecule
Emp. Form.C18H18ClN
Mol. Mass.283.795
SMILESClc1ccc(cc1)[C@@H]1CN2CCC[C@@H]2c2ccccc12