Reaction Details
TargetDihydrofolate reductase
LigandBDBM50022331
Substrate/Competitorn/a
Meas. Tech.ChEBML_54447
IC50 72±n/a nM
Citation Rosowsky, ASolan, VCForsch, RADelcamp, TJBaccanari, DPFreisheim, JH Methotrexate analogues. 30. Dihydrofolate reductase inhibition and in vitro tumor cell growth inhibition by N epsilon-(haloacetyl)-L-lysine and N delta-(haloacetyl)-L-ornithine analogues and an acivicin analogue of methotrexate. J Med Chem30:1463-9 (1987) Dihydrofolate reductase
Name:Dihydrofolate reductase
Type:Enzyme
Mol. Mass.:21608.82
Organism:Mus musculus (Mouse)
Description:n/a
Residue:187
BDBM50022331
NameBDBM50022331
Synonyms:6-(2-Bromo-acetylamino)-2-{4-[(2,4-diamino-pteridin-6-ylmethyl)-methyl-amino]-benzoylamino}-hexanoic acid | CHEMBL286658
TypeSmall organic molecule
Emp. Form.C23H28BrN9O4
Mol. Mass.574.43
SMILESCN(Cc1cnc2nc(N)nc(N)c2n1)c1ccc(cc1)C(=O)NC(CCCCNC(=O)CBr)C(O)=O