Reaction Details
TargetRenin
LigandBDBM50022835
Substrate/Competitorn/a
Meas. Tech.ChEBML_196287
IC50 0.100000±n/a nM
Citation Sawyer, TKPals, DTMao, BStaples, DJde Vaux, AEMaggiora, LLAffholter, JAKati, WDuchamp, DHester, JB Design, structure-activity, and molecular modeling studies of potent renin inhibitory peptides having N-terminal Nin-For-Trp (Ftr): angiotensinogen congeners modified by P1-P1' Phe-Phe, Sta, Leu psi[CH(OH)CH2]Val or leu psi[CH2NH]Val substitutions. J Med Chem31:18-30 (1988) Renin
Name:Renin
Type:Enzyme
Mol. Mass.:45058.99
Organism:Homo sapiens (Human)
Description:n/a
Residue:406
BDBM50022835
NameBDBM50022835
Synonyms:Ac-Ftr-Pro-Phe-His-Sta-Ile-NH2 | CHEMBL419531
TypeSmall organic molecule
Emp. Form.C48H64N10O9
Mol. Mass.925.0834
SMILESCC[C@H](C)[C@H](NC(=O)CC(O)[C@H](CC(C)C)NC(=O)[C@H](Cc1cnc[nH]1)NC(=O)[C@H](Cc1ccccc1)NC(=O)[C@@H]1CCCN1C(=O)[C@H](Cc1cn(C=O)c2ccccc12)NC(C)=O)C(N)=O