Reaction Details
TargetAdenosine receptor A2a/A2b
LigandBDBM50085667
Substrate/Competitorn/a
Meas. Tech.ChEMBL_30717 (CHEMBL646484)
Ki 9.1±n/a nM
Citation Trivedi, BKBristol, JABruns, RFHaleen, SJSteffen, RP N6-(arylalkyl)adenosines. Identification of N6-(9-fluorenylmethyl)adenosine as a highly potent agonist for the adenosine A2 receptor. J Med Chem31:271-3 (1988) Adenosine receptor A2a/A2b
Name:Adenosine receptor A2a/A2b
Synonyms:Adenosine A2 receptor
Type:n/a
Mol. Mass.:n/a
Description:ASSAY_ID of ChEMBL is 30560
Components:This complex has 2 components.
Component 1
Name:Adenosine receptor A2b
Type:PROTEIN
Mol. Mass.:36378.84
Organism:Rattus norvegicus
Description:ChEMBL_32934
Residue:332
Component 2
Name:Adenosine receptor A2a
Synonyms:AA2AR_RAT Adenosine A2 receptor Adenosine Receptors A2a (A2a) Adenosine receptors A2a Rat striatal adenosine A2a receptor
Type:G Protein-Coupled Receptor (GPCR)
Mol. Mass.:45015.65
Organism:Rattus norvegicus (rat)
Description:Rat A2A receptors expressed in CHO cells.
Residue:410
BDBM50085667
NameBDBM50085667
Synonyms:(2R,3S,4R,5R)-2-Hydroxymethyl-5-{6-[(naphthalen-1-ylmethyl)-amino]-purin-9-yl}-tetrahydro-furan-3,4-diol | CHEMBL132960
TypeSmall organic molecule
Emp. Form.C21H21N5O4
Mol. Mass.407.4225
SMILESOC[C@H]1O[C@H]([C@H](O)[C@@H]1O)n1cnc2c(NCc3cccc4ccccc34)ncnc12