Reaction Details
TargetAdenosine receptor A1
LigandBDBM50367598
Substrate/Competitorn/a
Meas. Tech.ChEBML_29324
Ki 62±n/a nM
Citation Trivedi, BKBristol, JABruns, RFHaleen, SJSteffen, RP N6-(arylalkyl)adenosines. Identification of N6-(9-fluorenylmethyl)adenosine as a highly potent agonist for the adenosine A2 receptor. J Med Chem31:271-3 (1988) Adenosine receptor A1
Name:Adenosine receptor A1
Type:Protein
Mol. Mass.:36704.13
Organism:Rattus norvegicus (rat)
Description:n/a
Residue:326
BDBM50367598
NameBDBM50367598
Synonyms:CHEMBL604967
TypeSmall organic molecule
Emp. Form.C24H23N5O5
Mol. Mass.461.4699
SMILESOC[C@H]1OC([C@H](O)[C@@H]1O)n1cnc2c(NCC3c4ccccc4Oc4ccccc34)ncnc12