Reaction Details
TargetAlpha-2A/Alpha-2B/Alpha-2C adrenergic receptor
LigandBDBM50029051
Substrate/Competitorn/a
Meas. Tech.ChEMBL_30106 (CHEMBL642033)
Ki 30±n/a nM
Citation Adejare, AGusovsky, FPadgett, WCreveling, CRDaly, JWKirk, KL Syntheses and adrenergic activities of ring-fluorinated epinephrines. J Med Chem31:1972-7 (1988) Alpha-2A/Alpha-2B/Alpha-2C adrenergic receptor
Name:Alpha-2A/Alpha-2B/Alpha-2C adrenergic receptor
Type:n/a
Mol. Mass.:n/a
Description:ASSAY_ID of ChEMBL is 305672
Components:This complex has 3 components.
Component 1
Name:Alpha-2B adrenergic receptor
Synonyms:ADA2B_HUMAN ADRA2L1 Adrenergic alpha2B Adrenergic receptor alpha Alpha-2 adrenergic receptor subtype C2 Alpha-2B adrenoreceptor | Alpha-2BAR
Type:Enzyme
Mol. Mass.:49964.20
Organism:Homo sapiens (Human)
Description:P18089
Residue:450
Component 2
Name:Alpha-2A adrenergic receptor
Synonyms:ADA2A_HUMAN ADRA2R Adrenergic alpha2A Alpha-2 adrenergic receptor subtype C10 Alpha-2A adrenoreceptor alpha-2A adrenergic receptor [Homo sapiens]
Type:Enzyme
Mol. Mass.:48979.91
Organism:Homo sapiens (Human)
Description:P08913
Residue:465
Component 3
Name:Alpha-2C adrenergic receptor
Synonyms:ADA2C_HUMAN ADRA2L2 Adrenergic alpha2C Adrenergic receptor alpha Alpha-2 adrenergic receptor subtype C4 Alpha-2C adrenoreceptor | adrenergic, alpha-2C-, receptor [Homo sapiens]
Type:Enzyme
Mol. Mass.:49552.32
Organism:Homo sapiens (Human)
Description:P18825
Residue:462
BDBM50029051
NameBDBM50029051
Synonyms:(-)-arterenol (-)-norepinephrine (R)-4-(2-amino-1-hydroxyethyl)-1,2-benzenediol (R)-norepinephrine CHEMBL1437 | NOREPINEPHRINE
TypeSmall organic molecule
Emp. Form.C8H11NO3
Mol. Mass.169.1778
SMILESNC[C@H](O)c1ccc(O)c(O)c1