Reaction Details
TargetMu-type opioid receptor
LigandBDBM50019094
Substrate/Competitorn/a
Meas. Tech.ChEBML_148709
Kd 26±n/a nM
Citation Lawson, JACheng, ADeGraw, JFrenking, GUyeno, EToll, LLoew, GH Effects of addition of a 2-methyl group to ethyl nipecotates (beta-meperidines) on receptor affinities and opiate agonist/antagonist activities. J Med Chem31:2015-21 (1988) Mu-type opioid receptor
Name:Mu-type opioid receptor
Type:G Protein-Coupled Receptor (GPCR)
Mol. Mass.:44503.11
Organism:Rattus norvegicus (rat)
Description:Competition binding assays were carried out using membrane preparations from transfected HN9.10 cells that constitutively expressed the mu opioid receptor.
Residue:398
BDBM50019094
NameBDBM50019094
Synonyms:1-Allyl-3-(3-hydroxy-phenyl)-piperidine-3-carboxylic acid ethyl ester | CHEMBL60294
TypeSmall organic molecule
Emp. Form.C17H23NO3
Mol. Mass.289.3694
SMILESCCOC(=O)[C@@]1(CCCN(CC=C)C1)c1cccc(O)c1