Reaction Details
TargetDelta-type opioid receptor
LigandBDBM50019095
Substrate/Competitorn/a
Meas. Tech.ChEBML_146779
Kd 770±n/a nM
Citation Lawson, JACheng, ADeGraw, JFrenking, GUyeno, EToll, LLoew, GH Effects of addition of a 2-methyl group to ethyl nipecotates (beta-meperidines) on receptor affinities and opiate agonist/antagonist activities. J Med Chem31:2015-21 (1988) Delta-type opioid receptor
Name:Delta-type opioid receptor
Type:G Protein-Coupled Receptor (GPCR)
Mol. Mass.:40465.04
Organism:Rattus norvegicus (rat)
Description:Competition binding assays were using CHO-K1 cell membranes expressing the opioid receptor.
Residue:372
BDBM50019095
NameBDBM50019095
Synonyms:1-Allyl-3-(3-hydroxy-phenyl)-2-methyl-piperidine-3-carboxylic acid ethyl ester | CHEMBL300357
TypeSmall organic molecule
Emp. Form.C18H25NO3
Mol. Mass.303.396
SMILESCCOC(=O)[C@@]1(CCCN(CC=C)[C@H]1C)c1cccc(O)c1