Reaction Details
TargetThymidylate synthase
LigandBDBM50022736
Substrate/Competitorn/a
Meas. Tech.ChEMBL_210332 (CHEMBL814751)
IC50 390±n/a nM
Citation Yang, IYSlusher, RMBroom, ADUeda, TCheng, YC A pyrimidine-based"flexible" bisubstrate analogue inhibitor of human thymidylate synthase. J Med Chem31:2126-32 (1988) Thymidylate synthase
Name:Thymidylate synthase
Type:Enzyme
Mol. Mass.:35718.07
Organism:Homo sapiens (Human)
Description:n/a
Residue:313
BDBM50022736
NameBDBM50022736
Synonyms:2-[4-({2-Amino-5-[1-(4-hydroxy-5-phosphonooxymethyl-tetrahydro-furan-2-yl)-2,4-dioxo-1,2,3,4-tetrahydro-pyrimidin-5-ylmethyl]-4-oxo-3,4,5,6,7,8-hexahydro-pyrido[3,2-d]pyrimidin-6-ylmethyl}-amino)-benzoylamino]-pentanedioic acid CHEMBL2368783 | thvmidvlate svnthase inhibitor 2
TypeSmall organic molecule
Emp. Form.C30H37N8O14P
Mol. Mass.764.6337
SMILESNc1nc(O)c2N(Cc3cn([C@H]4C[C@H](O)[C@@H](COP(O)(O)=O)O4)c(=O)[nH]c3=O)C(CNc3ccc(cc3)C(=O)NC(CCC(O)=O)C(O)=O)CCc2n1