Reaction Details
TargetAminopeptidase B
LigandBDBM50022744
Substrate/Competitorn/a
Meas. Tech.ChEBML_35352
Ki 4000±n/a nM
Citation Ocain, TDRich, DH Synthesis of sulfur-containing analogues of bestatin. Inhibition of aminopeptidases by alpha-thiolbestatin analogues. J Med Chem31:2193-9 (1988) Aminopeptidase B
Name:Aminopeptidase B
Type:PROTEIN
Mol. Mass.:72609.93
Organism:Rattus norvegicus
Description:ChEMBL_1344423
Residue:650
BDBM50022744
NameBDBM50022744
Synonyms:3-Amino-2-mercapto-N-(3-methyl-butyl)-4-phenyl-butyramide | CHEMBL69239
TypeSmall organic molecule
Emp. Form.C15H24N2OS
Mol. Mass.280.429
SMILESCC(C)CCNC(=O)[C@@H](S)[C@H](N)Cc1ccccc1