Reaction Details
TargetAminopeptidase B
LigandBDBM50022746
Substrate/Competitorn/a
Meas. Tech.ChEBML_35352
Ki 100000±n/a nM
Citation Ocain, TDRich, DH Synthesis of sulfur-containing analogues of bestatin. Inhibition of aminopeptidases by alpha-thiolbestatin analogues. J Med Chem31:2193-9 (1988) Aminopeptidase B
Name:Aminopeptidase B
Type:PROTEIN
Mol. Mass.:72609.93
Organism:Rattus norvegicus
Description:ChEMBL_1344423
Residue:650
BDBM50022746
NameBDBM50022746
Synonyms:2,6-Diamino-hexan-1-ol | CHEMBL69146
TypeSmall organic molecule
Emp. Form.C6H16N2O
Mol. Mass.132.204
SMILESNCCCC[C@@H](N)CO