Reaction Details
TargetAminopeptidase B
LigandBDBM50022748
Substrate/Competitorn/a
Meas. Tech.ChEBML_35352
Ki 130±n/a nM
Citation Ocain, TDRich, DH Synthesis of sulfur-containing analogues of bestatin. Inhibition of aminopeptidases by alpha-thiolbestatin analogues. J Med Chem31:2193-9 (1988) Aminopeptidase B
Name:Aminopeptidase B
Type:PROTEIN
Mol. Mass.:72609.93
Organism:Rattus norvegicus
Description:ChEMBL_1344423
Residue:650
BDBM50022748
NameBDBM50022748
Synonyms:2-Amino-4-methyl-pentane-1-thiol | CHEMBL69349
TypeSmall organic molecule
Emp. Form.C6H15NS
Mol. Mass.133.255
SMILESCC(C)C[C@@H](N)CS