Reaction Details
TargetAminopeptidase B
LigandBDBM50022752
Substrate/Competitorn/a
Meas. Tech.ChEBML_35352
Ki 159000±n/a nM
Citation Ocain, TDRich, DH Synthesis of sulfur-containing analogues of bestatin. Inhibition of aminopeptidases by alpha-thiolbestatin analogues. J Med Chem31:2193-9 (1988) Aminopeptidase B
Name:Aminopeptidase B
Type:PROTEIN
Mol. Mass.:72609.93
Organism:Rattus norvegicus
Description:ChEMBL_1344423
Residue:650
BDBM50022752
NameBDBM50022752
Synonyms:(R)-3-Amino-2-mercapto-4-phenyl-butyric acid methyl ester CHEMBL68092
TypeSmall organic molecule
Emp. Form.C11H15NO2S
Mol. Mass.225.307
SMILESCOC(=O)C(S)[C@H](N)Cc1ccccc1