Reaction Details
TargetAminopeptidase B
LigandBDBM50022749
Substrate/Competitorn/a
Meas. Tech.ChEBML_35352
Ki>1000000±n/a nM
Citation Ocain, TDRich, DH Synthesis of sulfur-containing analogues of bestatin. Inhibition of aminopeptidases by alpha-thiolbestatin analogues. J Med Chem31:2193-9 (1988) Aminopeptidase B
Name:Aminopeptidase B
Type:PROTEIN
Mol. Mass.:72609.93
Organism:Rattus norvegicus
Description:ChEMBL_1344423
Residue:650
BDBM50022749
NameBDBM50022749
Synonyms:2-Amino-4-methyl-pentan-1-ol D-Leucinol
TypeSmall organic molecule
Emp. Form.C6H15NO
Mol. Mass.117.1894
SMILESCC(C)C[C@@H](N)CO