Reaction Details
TargetCytosol aminopeptidase
LigandBDBM23971
Substrate/Competitorn/a
Meas. Tech.ChEBML_98398
Ki 20±n/a nM
Citation Ocain, TDRich, DH Synthesis of sulfur-containing analogues of bestatin. Inhibition of aminopeptidases by alpha-thiolbestatin analogues. J Med Chem31:2193-9 (1988) Cytosol aminopeptidase
Name:Cytosol aminopeptidase
Type:PROTEIN
Mol. Mass.:56171.75
Organism:Homo sapiens (Human)
Description:ChEMBL_1507539
Residue:519
BDBM23971
NameBDBM23971
Synonyms:(2S)-2-[(2S,3R)-3-amino-2-hydroxy-4-phenylbutanamido]-4-methylpentanoic acid CHEMBL29292 | Ubenimex
TypeSmall organic molecule
Emp. Form.C16H24N2O4
Mol. Mass.308.3728
SMILESCC(C)C[C@H](NC(=O)[C@@H](O)[C@H](N)Cc1ccccc1)C(O)=O