Reaction Details
TargetAminopeptidase B
LigandBDBM50022750
Substrate/Competitorn/a
Meas. Tech.ChEBML_35352
Ki>1000000±n/a nM
Citation Ocain, TDRich, DH Synthesis of sulfur-containing analogues of bestatin. Inhibition of aminopeptidases by alpha-thiolbestatin analogues. J Med Chem31:2193-9 (1988) Aminopeptidase B
Name:Aminopeptidase B
Type:PROTEIN
Mol. Mass.:72609.93
Organism:Rattus norvegicus
Description:ChEMBL_1344423
Residue:650
BDBM50022750
NameBDBM50022750
Synonyms:3-Amino-2-hydroxy-4-phenyl-butyric acid methyl ester | CHEMBL68686
TypeSmall organic molecule
Emp. Form.C11H15NO3
Mol. Mass.209.2417
SMILESCOC(=O)C(O)[C@H](N)Cc1ccccc1