Reaction Details
TargetCholecystokinin receptor type A
LigandBDBM50060321
Substrate/Competitorn/a
Meas. Tech.ChEMBL_49559 (CHEMBL663475)
IC50 8.3±n/a nM
Citation Evans, BERittle, KEBock, MGDiPardo, RMFreidinger, RMWhitter, WLLundell, GFVeber, DFAnderson, PSChang, RS Methods for drug discovery: development of potent, selective, orally effective cholecystokinin antagonists. J Med Chem31:2235-46 (1989) Cholecystokinin receptor type A
Name:Cholecystokinin receptor type A
Type:Enzyme Catalytic Domain
Mol. Mass.:49676.37
Organism:RAT
Description:Cholecystokinin central 0 RAT::P30551
Residue:444
BDBM50060321
NameBDBM50060321
Synonyms:1H-Indole-2-carboxylic acid ((R)-1-methyl-2-oxo-5-phenyl-2,3-dihydro-1H-benzo[e][1,4]diazepin-3-yl)-amide CCK antagonist synthetic 19 | CHEMBL419764
TypeSmall organic molecule
Emp. Form.C25H20N4O2
Mol. Mass.408.4519
SMILESCN1c2ccccc2C(=N[C@@H](NC(=O)c2cc3ccccc3[nH]2)C1=O)c1ccccc1