Reaction Details
TargetD(2) dopamine receptor
LigandBDBM50366495
Substrate/Competitorn/a
Meas. Tech.ChEBML_58693
IC50 12±n/a nM
Citation Liljefors, TBøgesø, KP Conformational analysis and structural comparisons of (1R,3S)-(+)- and (1S,3R)-(-)-tefludazine, (S)-(+)- and (R)-(-)-octoclothepin, and (+)-dexclamol in relation to dopamine receptor antagonism and amine-uptake inhibition. J Med Chem31:306-12 (1988) D(2) dopamine receptor
Name:D(2) dopamine receptor
Type:G Protein-Coupled Receptor (GPCR)
Mol. Mass.:50931.60
Organism:Rattus norvegicus (rat)
Description:P61169
Residue:444
BDBM50366495
NameBDBM50366495
Synonyms:(+)butaclamol | CHEMBL1255588
TypeSmall organic molecule
Emp. Form.C25H31NO
Mol. Mass.361.5197
SMILESCC(C)(C)[C@@]1(O)CCN2C[C@@H]3c4ccccc4CCc4cccc([C@H]2C1)c34