Reaction Details
TargetPurine nucleoside phosphorylase
LigandBDBM50225889
Substrate/Competitorn/a
Meas. Tech.ChEMBL_153332 (CHEMBL760484)
Ki 110000±n/a nM
Citation Sanghvi, YSHanna, NBLarson, SBFujitaki, JMWillis, RCSmith, RARobins, RKRevankar, GR Synthesis and evaluation of 5-amino-1-beta-D-ribofuranosyl-1,2,4-triazole-3-carboxamidine and certain related nucleosides as inhibitors of purine nucleoside phosphorylase. J Med Chem31:330-5 (1988) Purine nucleoside phosphorylase
Name:Purine nucleoside phosphorylase
Type:Enzyme
Mol. Mass.:32119.53
Organism:Homo sapiens (Human)
Description:n/a
Residue:289
BDBM50225889
NameBDBM50225889
Synonyms:CHEMBL3144008
TypeSmall organic molecule
Emp. Form.C10H12N4O5
Mol. Mass.268.2261
SMILESOC[C@H]1O[C@H]([C@H](O)[C@@H]1O)C1=NNC2C1=NC=NC2=O