Reaction Details
TargetD(2) dopamine receptor
LigandBDBM50020705
Substrate/Competitorn/a
Meas. Tech.ChEBML_63034
Ki 30±n/a nM
Citation Kung, HFKasliwal, RPan, SGKung, MPMach, RHGuo, YZ Dopamine D-2 receptor imaging radiopharmaceuticals: synthesis, radiolabeling, and in vitro binding of (R)-(+)- and (S)-(-)-3-iodo-2-hydroxy-6-methoxy-N- [(1-ethyl-2-pyrrolidinyl)methyl]benzamide. J Med Chem31:1039-43 (1988) D(2) dopamine receptor
Name:D(2) dopamine receptor
Type:G Protein-Coupled Receptor (GPCR)
Mol. Mass.:50931.60
Organism:Rattus norvegicus (rat)
Description:P61169
Residue:444
BDBM50020705
NameBDBM50020705
Synonyms:CHEMBL8674 | N-(1-Ethyl-pyrrolidin-2-ylmethyl)-2-hydroxy-3-iodo-6-methoxy-benzamide
TypeSmall organic molecule
Emp. Form.C15H21IN2O3
Mol. Mass.404.2433
SMILESCCN1CCC[C@@H]1CNC(=O)c1c(O)c(I)ccc1OC