Reaction Details
TargetAngiotensin-converting enzyme
LigandBDBM50018849
Substrate/Competitorn/a
Meas. Tech.ChEBML_34931
Ki 1.5±n/a nM
Citation Krapcho, JTurk, CCushman, DWPowell, JRDeForrest, JMSpitzmiller, ERKaranewsky, DSDuggan, MRovnyak, GSchwartz, J Angiotensin-converting enzyme inhibitors. Mercaptan, carboxyalkyl dipeptide, and phosphinic acid inhibitors incorporating 4-substituted prolines. J Med Chem31:1148-60 (1988) Angiotensin-converting enzyme
Name:Angiotensin-converting enzyme
Type:n/a
Mol. Mass.:150405.15
Organism:Oryctolagus cuniculus
Description:n/a
Residue:1310
BDBM50018849
NameBDBM50018849
Synonyms:4-Cyclohexyl-1-{2-[hydroxy-(4-phenyl-butyl)-phosphinoyl]-acetyl}-pyrrolidine-2-carboxylic acid FOSINOPRILAT
TypeSmall organic molecule
Emp. Form.C23H34NO5P
Mol. Mass.435.4935
SMILESOC(=O)[C@@H]1C[C@H](CN1C(=O)CP(O)(=O)CCCCc1ccccc1)C1CCCCC1