Reaction Details
TargetAdenosine receptor A2a/A2b
LigandBDBM50367695
Substrate/Competitorn/a
Meas. Tech.ChEMBL_30569 (CHEMBL649881)
Ki 20±n/a nM
Citation Bridges, AJBruns, RFOrtwine, DFPriebe, SRSzotek, DLTrivedi, BK N6-[2-(3,5-dimethoxyphenyl)-2-(2-methylphenyl)ethyl]adenosine and its uronamide derivatives. Novel adenosine agonists with both high affinity and high selectivity for the adenosine A2 receptor. J Med Chem31:1282-5 (1988) Adenosine receptor A2a/A2b
Name:Adenosine receptor A2a/A2b
Synonyms:Adenosine A2 receptor
Type:n/a
Mol. Mass.:n/a
Description:ASSAY_ID of ChEMBL is 30560
Components:This complex has 2 components.
Component 1
Name:Adenosine receptor A2b
Type:PROTEIN
Mol. Mass.:36378.84
Organism:Rattus norvegicus
Description:ChEMBL_32934
Residue:332
Component 2
Name:Adenosine receptor A2a
Synonyms:AA2AR_RAT Adenosine A2 receptor Adenosine Receptors A2a (A2a) Adenosine receptors A2a Rat striatal adenosine A2a receptor
Type:G Protein-Coupled Receptor (GPCR)
Mol. Mass.:45015.65
Organism:Rattus norvegicus (rat)
Description:Rat A2A receptors expressed in CHO cells.
Residue:410
BDBM50367695
NameBDBM50367695
Synonyms:CHEMBL606506
TypeSmall organic molecule
Emp. Form.C28H33N5O6
Mol. Mass.535.5915
SMILESCOc1cc(OC)cc(c1)C(CNc1ncnc2n(cnc12)C1O[C@H](CO)[C@@H](O)[C@H]1O)c1c(C)cccc1C