Reaction Details
TargetAdenosine receptor A1
LigandBDBM50397724
Substrate/Competitorn/a
Meas. Tech.ChEMBL_28995 (CHEMBL643470)
Ki 5.2±n/a nM
Citation Bridges, AJBruns, RFOrtwine, DFPriebe, SRSzotek, DLTrivedi, BK N6-[2-(3,5-dimethoxyphenyl)-2-(2-methylphenyl)ethyl]adenosine and its uronamide derivatives. Novel adenosine agonists with both high affinity and high selectivity for the adenosine A2 receptor. J Med Chem31:1282-5 (1988) Adenosine receptor A1
Name:Adenosine receptor A1
Type:Protein
Mol. Mass.:36704.13
Organism:Rattus norvegicus (rat)
Description:n/a
Residue:326
BDBM50397724
NameBDBM50397724
Synonyms:CHEMBL2181971
TypeSmall organic molecule
Emp. Form.C24H23N5O4
Mol. Mass.445.4705
SMILESOC[C@H]1O[C@H]([C@H](O)[C@@H]1O)n1cnc2c(NCC3c4ccccc4-c4ccccc34)ncnc12