Reaction Details
TargetMuscarinic acetylcholine receptor M2
LigandBDBM50010096
Substrate/Competitorn/a
Meas. Tech.ChEMBL_140174 (CHEMBL745478)
Ki 0.230000±n/a nM
Citation Rzeszotarski, WJMcPherson, DWFerkany, JWKinnier, WJNoronha-Blob, LKirkien-Rzeszotarski, A Affinity and selectivity of the optical isomers of 3-quinuclidinyl benzilate and related muscarinic antagonists. J Med Chem31:1463-6 (1988) Muscarinic acetylcholine receptor M2
Name:Muscarinic acetylcholine receptor M2
Type:Enzyme Catalytic Domain
Mol. Mass.:51555.53
Organism:RAT
Description:P10980
Residue:466
BDBM50010096
NameBDBM50010096
Synonyms:CHEMBL12980 Hydroxy-diphenyl-acetic acid 1-aza-bicyclo[2.2.2]oct-3-yl ester(QNB) | Hydroxy-diphenyl-acetic acid 1-aza-bicyclo[2.2.2]oct-3-yl ester(R)-(-)-(QNB)
TypeSmall organic molecule
Emp. Form.C21H23NO3
Mol. Mass.337.4122
SMILESOC(C(=O)OC1CN2CCC1CC2)(c1ccccc1)c1ccccc1