Reaction Details
TargetMuscarinic receptor M1
LigandBDBM50405718
Substrate/Competitorn/a
Meas. Tech.ChEBML_140160
Ki 19±n/a nM
Citation Rzeszotarski, WJMcPherson, DWFerkany, JWKinnier, WJNoronha-Blob, LKirkien-Rzeszotarski, A Affinity and selectivity of the optical isomers of 3-quinuclidinyl benzilate and related muscarinic antagonists. J Med Chem31:1463-6 (1988) Muscarinic receptor M1
Name:Muscarinic receptor M1
Synonyms:Muscarinic acetylcholine receptor M1
Type:PROTEIN
Mol. Mass.:15022.43
Organism:Bos taurus
Description:ChEMBL_140161
Residue:139
BDBM50405718
NameBDBM50405718
Synonyms:CHEMBL2114396
TypeSmall organic molecule
Emp. Form.C16H21NO3
Mol. Mass.275.3428
SMILESC[C@](O)(C(=O)O[C@@H]1CN2CCC1CC2)c1ccccc1