Reaction Details
TargetIgA-specific serine endopeptidase autotransporter
LigandBDBM50367749
Substrate/Competitorn/a
Meas. Tech.ChEBML_88881
IC50 1810000±n/a nM
Citation Burton, JWood, SGLynch, MPlaut, AG Substrate analogue inhibitors of the IgA1 proteinases from Neisseria gonorrhoeae. J Med Chem31:1647-51 (1988) IgA-specific serine endopeptidase autotransporter
Name:IgA-specific serine endopeptidase autotransporter
Type:PROTEIN
Mol. Mass.:169014.39
Organism:Neisseria gonorrhoeae
Description:ChEMBL_88881
Residue:1532
BDBM50367749
NameBDBM50367749
Synonyms:CHEMBL2369559
TypeSmall organic molecule
Emp. Form.C70H108N18O24S2
Mol. Mass.1649.843
SMILESC[C@H](O)[C@H](NC(=O)[C@@H]1CCCN1C(=O)[C@@H]1CCCN1C(=O)[C@H](CSSC[C@H](NC(C)=O)C(=O)N1CCC[C@H]1C(=O)N1CCC[C@H]1C(=O)N[C@@H]([C@H](C)O)C(=O)N1CCC[C@H]1C(=O)N[C@@H](CO)C(=O)N1CCC[C@H]1C(=O)N[C@@H](CO)C(N)=O)NC(C)=O)C(=O)N1CCC[C@H]1C(=O)N[C@@H](CO)C(=O)N1CCC[C@H]1C(=O)N[C@@H](CO)C(N)=O