Reaction Details
TargetIgA-specific serine endopeptidase autotransporter
LigandBDBM50367753
Substrate/Competitorn/a
Meas. Tech.ChEMBL_88881 (CHEMBL698217)
IC50 400000±n/a nM
Citation Burton, JWood, SGLynch, MPlaut, AG Substrate analogue inhibitors of the IgA1 proteinases from Neisseria gonorrhoeae. J Med Chem31:1647-51 (1988) IgA-specific serine endopeptidase autotransporter
Name:IgA-specific serine endopeptidase autotransporter
Type:PROTEIN
Mol. Mass.:169014.39
Organism:Neisseria gonorrhoeae
Description:ChEMBL_88881
Residue:1532
BDBM50367753
NameBDBM50367753
Synonyms:CHEMBL2369569
TypeSmall organic molecule
Emp. Form.C34H55N9O12
Mol. Mass.781.8536
SMILESC[C@@H](O)[C@H](N)C(=O)N1CCC[C@H]1C(=O)N1CCC[C@H]1C(=O)N[C@@H]([C@H](C)O)C(=O)N1CCC[C@H]1C(=O)N[C@@H](CO)C(=O)N1CCC[C@H]1C(=O)N[C@@H](CO)C(N)=O