Reaction Details
TargetIgA-specific serine endopeptidase autotransporter
LigandBDBM50367756
Substrate/Competitorn/a
Meas. Tech.ChEBML_88881
IC50 310000±n/a nM
Citation Burton, JWood, SGLynch, MPlaut, AG Substrate analogue inhibitors of the IgA1 proteinases from Neisseria gonorrhoeae. J Med Chem31:1647-51 (1988) IgA-specific serine endopeptidase autotransporter
Name:IgA-specific serine endopeptidase autotransporter
Type:PROTEIN
Mol. Mass.:169014.39
Organism:Neisseria gonorrhoeae
Description:ChEMBL_88881
Residue:1532
BDBM50367756
NameBDBM50367756
Synonyms:CHEMBL2369562
TypeSmall organic molecule
Emp. Form.C35H55N9O12S
Mol. Mass.825.929
SMILESC[C@H](O)[C@H](NC(=O)[C@@H]1CCCN1C(=O)[C@@H]1CCCN1C(=O)[C@H](CS)NC(C)=O)C(=O)N1CCC[C@H]1C(=O)N[C@@H](CO)C(=O)N1CCC[C@H]1C(=O)N[C@@H](CO)C(N)=O