Reaction Details
TargetIgA-specific serine endopeptidase autotransporter
LigandBDBM50367758
Substrate/Competitorn/a
Meas. Tech.ChEBML_88881
IC50 310000±n/a nM
Citation Burton, JWood, SGLynch, MPlaut, AG Substrate analogue inhibitors of the IgA1 proteinases from Neisseria gonorrhoeae. J Med Chem31:1647-51 (1988) IgA-specific serine endopeptidase autotransporter
Name:IgA-specific serine endopeptidase autotransporter
Type:PROTEIN
Mol. Mass.:169014.39
Organism:Neisseria gonorrhoeae
Description:ChEMBL_88881
Residue:1532
BDBM50367758
NameBDBM50367758
Synonyms:CHEMBL2369564
TypeSmall organic molecule
Emp. Form.C67H106N16O24
Mol. Mass.1519.6513
SMILESC[C@@H](O)[C@H](N)C(=O)N1CCC[C@H]1C(=O)N1CCC[C@H]1C(=O)N[C@@H]([C@H](C)O)C(=O)N1CCC[C@H]1C(=O)N[C@@H](CO)C(=O)N1CCC[C@H]1C(=O)N[C@@H](CO)C(=O)N[C@@H]([C@H](C)O)C(=O)N1CCC[C@H]1C(=O)N1CCC[C@H]1C(=O)N[C@@H]([C@@H](C)O)C(=O)N1CCC[C@H]1C(=O)N[C@@H](CO)N1CCC[C@H]1C(=O)N[C@@H](CO)C(O)=O