Reaction Details
TargetTyrosine-protein kinase transforming protein Abl
LigandBDBM50292496
Substrate/Competitorn/a
Meas. Tech.ChEBML_221791
IC50 19000±n/a nM
Citation Kruse, CHHolden, KGPritchard, MLFeild, JARieman, DJGreig, RGPoste, G Synthesis and evaluation of multisubstrate inhibitors of an oncogene-encoded tyrosine-specific protein kinase. 1. J Med Chem31:1762-7 (1988) Tyrosine-protein kinase transforming protein Abl
Name:Tyrosine-protein kinase transforming protein Abl
Type:Enzyme
Mol. Mass.:81895.89
Organism:Abelson murine leukemia virus
Description:P00521
Residue:746
BDBM50292496
NameBDBM50292496
Synonyms:((2R,3S,4R,5R)-5-(6-amino-9H-purin-9-yl)-3,4-dihydroxytetrahydrofuran-2-yl)methyl 4-(N-phenylsulfamoyl)benzoate | CHEMBL484659
TypeSmall organic molecule
Emp. Form.C23H22N6O7S
Mol. Mass.526.522
SMILESNc1ncnc2n(cnc12)[C@@H]1O[C@H](COC(=O)c2ccc(cc2)S(=O)(=O)Nc2ccccc2)[C@@H](O)[C@H]1O