Reaction Details
TargetTyrosine-protein kinase transforming protein Abl
LigandBDBM50292480
Substrate/Competitorn/a
Meas. Tech.ChEBML_221795
IC50 16000±n/a nM
Citation Kruse, CHHolden, KGOffen, PHPritchard, MLFeild, JARieman, DJBender, PEFerguson, BGreig, RGPoste, G Synthesis and evaluation of multisubstrate inhibitors of an oncogene-encoded tyrosine-specific protein kinase. 2. J Med Chem31:1768-72 (1988) Tyrosine-protein kinase transforming protein Abl
Name:Tyrosine-protein kinase transforming protein Abl
Type:Enzyme
Mol. Mass.:81895.89
Organism:Abelson murine leukemia virus
Description:P00521
Residue:746
BDBM50292480
NameBDBM50292480
Synonyms:CHEMBL445698 | {[(2R,3S,4R,5R)-5-(6-amino-9H-purin-9-yl)-3,4-dihydroxyoxolan-2-yl]methoxy}({[hydroxy({[hydroxy({hydroxy[(4-methylphenyl)amino]phosphoryl}oxy)phosphoryl]oxy})phosphoryl]oxy})phosphinic acid
TypeSmall organic molecule
Emp. Form.C17H24N6O15P4
Mol. Mass.676.2987
SMILESCc1ccc(NP(O)(=O)OP(O)(=O)OP(O)(=O)OP(O)(=O)OC[C@H]2O[C@H]([C@H](O)[C@@H]2O)n2cnc3c(N)ncnc23)cc1